UDN-企业互联网技术人气社区

板块导航

浏览  : 3968
回复  : 15

[分析云] NC5X_IBM_WAS6.1_EJB部署小结

[复制链接]
柒凉~的头像 楼主
发表于 2017-10-28 19:11:06 | 显示全部楼层
andy796 发表于 2017-10-28 14:55
同被坑,大概是文件过期了

被论坛玩坏了,找版主
使用道具 举报

回复

发表于 2018-1-29 11:27:35 | 显示全部楼层
能重新上传一份吗
点评 ( 1 ) 收起 / 展开点评

柒凉~ 2018年01月30日 10:39 详情 回复

重传了

使用道具 举报

回复

柒凉~的头像 楼主
发表于 2018-1-30 10:39:16 | 显示全部楼层
king 发表于 2018-1-29 11:27
能重新上传一份吗

重传了
使用道具 举报

回复

发表于 2018-4-11 10:20:18 | 显示全部楼层
正在学习NC+was集群,自己搭建环境出错
使用道具 举报

回复

发表于 2018-6-4 15:42:30 | 显示全部楼层
好东西,正是现在所需
使用道具 举报

回复

发表于 2020-5-8 17:30:26 | 显示全部楼层
was8+NC   部署出的问题  求大佬解决

Installed Applications:
Installed Applications:
Install application in progress
Fri May 08 17:10:50 CST 2020 - ADMA5016I: Installation of nc65 started.
Fri May 08 17:11:26 CST 2020 - ADMA5058I: Application and module versions are validated with versions of deployment targets.
Fri May 08 17:11:26 CST 2020 - ADMA5018I: The EJBDeploy program is running on file /data/hzwhrtest/dist/nc.ear.
Fri May 08 17:11:26 CST 2020 - ADMA5008E: The EJBDeploy program failed on file /data/hzwhrtest/dist/nc.ear.  Exception: com.ibm.etools.ejbdeploy.IllegalFilenameException: Cannot create file /opt/IBM/WebSphere/AppServer/profiles/Dmgr65/wstemp/appmgmt/mbean/AppManagement_171f385fa9d_1/app_171f38d30d0/dpl/dpl_nc65.ear.
Fri May 08 17:11:26 CST 2020 - ADMA0063E: An error occurred during Enterprise JavaBeans (EJB) deployment.  Exception: com.ibm.etools.ejbdeploy.IllegalFilenameException: Cannot create file /opt/IBM/WebSphere/AppServer/profiles/Dmgr65/wstemp/appmgmt/mbean/AppManagement_171f385fa9d_1/app_171f38d30d0/dpl/dpl_nc65.ear.
Fri May 08 17:11:26 CST 2020 - ADMA5011I: The cleanup of the temp directory for application nc65 is complete.
ADMA5014E: The installation of application nc65 failed.
Install application failed.
java.lang.Exception: Failed deploy application
        at nc.bs.framework.was.admin.ApplicationManage.install(ApplicationManage.java:197)
        at nc.bs.framework.was.admin.WasSetup.installApp(WasSetup.java:318)
        at nc.bs.framework.was.admin.WasSetup.configureAndInstall(WasSetup.java:242)
        at nc.bs.framework.was.admin.WasSetupStarter.main(WasSetupStarter.java:154)
        at sun.reflect.NativeMethodAccessorImpl.invoke0(Native Method)
        at sun.reflect.NativeMethodAccessorImpl.invoke(NativeMethodAccessorImpl.java:88)
        at sun.reflect.DelegatingMethodAccessorImpl.invoke(DelegatingMethodAccessorImpl.java:55)
        at java.lang.reflect.Method.invoke(Method.java:613)
        at nc.bs.framework.tool.config.util.impl.WasUtils.invokeStarterMain(WasUtils.java:367)
        at nc.bs.framework.tool.config.deployment.FullDeploymentPanel$3$1.run(FullDeploymentPanel.java:259)

Closing session ...
java.lang.Exception: Failed deploy application
        at nc.bs.framework.was.admin.ApplicationManage.install(ApplicationManage.java:197)
        at nc.bs.framework.was.admin.WasSetup.installApp(WasSetup.java:318)
        at nc.bs.framework.was.admin.WasSetup.configureAndInstall(WasSetup.java:242)
        at nc.bs.framework.was.admin.WasSetupStarter.main(WasSetupStarter.java:154)
        at sun.reflect.NativeMethodAccessorImpl.invoke0(Native Method)
        at sun.reflect.NativeMethodAccessorImpl.invoke(NativeMethodAccessorImpl.java:88)
        at sun.reflect.DelegatingMethodAccessorImpl.invoke(DelegatingMethodAccessorImpl.java:55)
        at java.lang.reflect.Method.invoke(Method.java:613)
        at nc.bs.framework.tool.config.util.impl.WasUtils.invokeStarterMain(WasUtils.java:367)
        at nc.bs.framework.tool.config.deployment.FullDeploymentPanel$3$1.run(FullDeploymentPanel.java:259)
java.lang.reflect.InvocationTargetException
        at sun.reflect.NativeMethodAccessorImpl.invoke0(Native Method)
        at sun.reflect.NativeMethodAccessorImpl.invoke(NativeMethodAccessorImpl.java:88)
        at sun.reflect.DelegatingMethodAccessorImpl.invoke(DelegatingMethodAccessorImpl.java:55)
        at java.lang.reflect.Method.invoke(Method.java:613)
        at nc.bs.framework.tool.config.util.impl.WasUtils.invokeStarterMain(WasUtils.java:367)
        at nc.bs.framework.tool.config.deployment.FullDeploymentPanel$3$1.run(FullDeploymentPanel.java:259)
Caused by: java.lang.Exception: Failed deploy application
        at nc.bs.framework.was.admin.ApplicationManage.install(ApplicationManage.java:197)
        at nc.bs.framework.was.admin.WasSetup.installApp(WasSetup.java:318)
        at nc.bs.framework.was.admin.WasSetup.configureAndInstall(WasSetup.java:242)
        at nc.bs.framework.was.admin.WasSetupStarter.main(WasSetupStarter.java:154)
        ... 6 more
java.lang.reflect.InvocationTargetException
        at sun.reflect.NativeMethodAccessorImpl.invoke0(Native Method)
        at sun.reflect.NativeMethodAccessorImpl.invoke(NativeMethodAccessorImpl.java:88)
        at sun.reflect.DelegatingMethodAccessorImpl.invoke(DelegatingMethodAccessorImpl.java:55)
        at java.lang.reflect.Method.invoke(Method.java:613)
        at nc.bs.framework.tool.config.util.impl.WasUtils.invokeStarterMain(WasUtils.java:367)
        at nc.bs.framework.tool.config.deployment.FullDeploymentPanel$3$1.run(FullDeploymentPanel.java:259)
Caused by: java.lang.Exception: Failed deploy application
        at nc.bs.framework.was.admin.ApplicationManage.install(ApplicationManage.java:197)
        at nc.bs.framework.was.admin.WasSetup.installApp(WasSetup.java:318)
        at nc.bs.framework.was.admin.WasSetup.configureAndInstall(WasSetup.java:242)
        at nc.bs.framework.was.admin.WasSetupStarter.main(WasSetupStarter.java:154)
        ... 6 more
使用道具 举报

回复

您需要登录后才可以回帖 登录 | 立即注册

本版积分规则

关于我们
联系我们
  • 电话:010-86393388
  • 邮件:udn@yonyou.com
  • 地址:北京市海淀区北清路68号
移动客户端下载
关注我们
  • 微信公众号:yonyouudn
  • 扫描右侧二维码关注我们
  • 专注企业互联网的技术社区
版权所有:用友网络科技股份有限公司82041 京ICP备05007539号-11 京公网网备安1101080209224 Powered by Discuz!
快速回复 返回列表 返回顶部